{"text_format":"3","workbook":"xlsx","n_sheets":3,"sheets":["Startseite","Innenmaß","Plattenmaß"],"not_rendered":{"images":8,"defined_names":2},"read":"whole","date_system":"1900"}

{"sheet":"Startseite","index":0,"n_rows":35,"n_cols":11,"rows_kept":35,"merged":[[0,0,0,10],[34,8,34,9]]}
["WERKNORM für ALU-MONITOR-Gehäuse"]
{"$rows_empty":8}
[null,"Eingabe","über Profillänge(n) / "]
[null,null,"Innenmaß Gehäuse"]
[null,null,"hier klicken"]
[]
[]
[null,"Eingabe","über Aussenmaß der "]
[null,null,"ALU-Platte"]
[null,null,"hier klicken"]
{"$rows_empty":17}
[{"$nulls":8},"letztes Update:",null,"2016-03-02"]

{"sheet":"Innenmaß","index":1,"n_rows":57,"n_cols":25,"rows_kept":57,"merged":[[1,1,1,7],[23,2,23,6],[23,7,23,23],[27,3,27,9],[30,3,30,5],[30,7,30,9],[30,19,30,21],[30,23,30,25],[32,3,32,5],[32,7,32,9],[32,19,32,21],[32,23,32,25],[34,3,34,5],[34,7,34,9],[34,19,34,21],[34,23,34,25],[36,3,36,5],[36,7,36,9],[36,19,36,21],[36,23,36,25],[38,18,38,21],[47,17,47,21],[47,22,47,26],[48,22,48,26]]}
[]
[null,"zurück zur Startseite"]
[]
["Maßfestlegung über Innenmaß der ALU-Platte(n)"]
[]
[]
[]
[]
[]
["H30"]
["H40"]
["H50"]
["H60"]
["H70"]
["H80"]
["H100"]
{"$rows_empty":7}
[null,null,"H30",{"$nulls":4},"AUSWAHL Profiltyp"]
[]
[null,"EINGABE Innenmaß ALU-Platte"]
[]
[{"$nulls":3},"Innenmaß [mm]",{"$nulls":9},"ALU-Platten-",{"$nulls":5},"Abmaße ALU-Platte [mm}"]
[{"$nulls":5},"A ","x","B",{"$nulls":5},"dicke s =",{"$nulls":6},"D",null,"x",null,"E"]
[]
[{"$nulls":3},{"v":0,"d":"0.00"},null,null,"x",{"v":0,"d":"0.00"},{"$nulls":5},"1,5 mm",{"$nulls":5},{"$f":"IF(Profiltyp=\"H30\",$D$31+(2*7.8),IF(Profiltyp=\"H40\",$D$31+(2*8.6),IF(Profiltyp=\"H50\",$D$31+(2*8.5),IF(Profiltyp=\"H60\",$D$31+(2*8.5),IF(Profiltyp=\"H70\",$D$31+(2*8.5),IF(Profiltyp=\"H80\",$D$31+(2*8.5),IF(Profiltyp=\"H100\",$D$31+(2*8.5),\"FEHLER\")))))))","v":{"v":15.6,"d":"15.60"}},null,null,"x",{"$f":"IF(Profiltyp=\"H30\",$H$31+(2*7.8),IF(Profiltyp=\"H40\",$H$31+(2*8.6),IF(Profiltyp=\"H50\",$H$31+(2*8.5),IF(Profiltyp=\"H60\",$H$31+(2*8.5),IF(Profiltyp=\"H70\",$H$31+(2*8.5),IF(Profiltyp=\"H80\",$H$31+(2*8.5),IF(Profiltyp=\"H100\",$H$31+(2*8.5),\"FEHLER\")))))))","v":{"v":15.6,"d":"15.60"}}]
[]
[{"$nulls":13},"2,0 mm",{"$nulls":5},{"$f":"IF(Profiltyp=\"H30\",$D$31+(2*4.3),IF(Profiltyp=\"H40\",$D$31+(2*5.7),IF(Profiltyp=\"H50\",$D$31+(2*6.3),IF(Profiltyp=\"H60\",$D$31+(2*6.3),IF(Profiltyp=\"H70\",$D$31+(2*6.3),IF(Profiltyp=\"H80\",$D$31+(2*6.3),IF(Profiltyp=\"H100\",$D$31+(2*6.3),\"FEHLER\")))))))","v":{"v":8.6,"d":"8.60"}},null,null,"x",{"$f":"IF(Profiltyp=\"H30\",$H$31+(2*4.3),IF(Profiltyp=\"H40\",$H$31+(2*5.7),IF(Profiltyp=\"H50\",$H$31+(2*6.3),IF(Profiltyp=\"H60\",$H$31+(2*6.3),IF(Profiltyp=\"H70\",$H$31+(2*6.3),IF(Profiltyp=\"H80\",$H$31+(2*6.3),IF(Profiltyp=\"H100\",$H$31+(2*6.3),\"FEHLER\")))))))","v":{"v":8.6,"d":"8.60"}}]
[]
[{"$nulls":13},"2,5 mm",{"$nulls":5},{"$f":"IF(Profiltyp=\"H30\",\"NV\",IF(Profiltyp=\"H40\",$D$31+(2*3),IF(Profiltyp=\"H50\",$D$31+(2*4.3),IF(Profiltyp=\"H60\",$D$31+(2*4.3),IF(Profiltyp=\"H70\",$D$31+(2*4.3),IF(Profiltyp=\"H80\",$D$31+(2*4.3),IF(Profiltyp=\"H100\",$D$31+(2*4.3),\"FEHLER\")))))))","v":"NV"},null,null,"x",{"$f":"IF(Profiltyp=\"H30\",\"NV\",IF(Profiltyp=\"H40\",$H$31+(2*3),IF(Profiltyp=\"H50\",$H$31+(2*4.3),IF(Profiltyp=\"H60\",$H$31+(2*4.3),IF(Profiltyp=\"H70\",$H$31+(2*4.3),IF(Profiltyp=\"H80\",$H$31+(2*4.3),IF(Profiltyp=\"H100\",$H$31+(2*4.3),\"FEHLER\")))))))","v":"NV"}]
[]
[{"$nulls":13},"3,0 mm",{"$nulls":5},{"$f":"IF(Profiltyp=\"H30\",\"NV\",IF(Profiltyp=\"H40\",\"NV\",IF(Profiltyp=\"H50\",$D$31+(2*2.3),IF(Profiltyp=\"H60\",$D$31+(2*2.3),IF(Profiltyp=\"H70\",$D$31+(2*2.3),IF(Profiltyp=\"H80\",$D$31+(2*2.3),IF(Profiltyp=\"H100\",$D$31+(2*2.3),\"FEHLER\")))))))","v":"NV"},null,null,"x",{"$f":"IF(Profiltyp=\"H30\",\"NV\",IF(Profiltyp=\"H40\",\"NV\",IF(Profiltyp=\"H50\",$H$31+(2*2.3),IF(Profiltyp=\"H60\",$H$31+(2*2.3),IF(Profiltyp=\"H70\",$H$31+(2*2.3),IF(Profiltyp=\"H80\",$H$31+(2*2.3),IF(Profiltyp=\"H100\",$H$31+(2*2.3),\"FEHLER\")))))))","v":"NV"}]
[]
[{"$nulls":3},"EINGABE über Aussenmaß der ALU-Platte(n)",{"$nulls":14},"hier klicken"]
[]
[]
[null,"INFO: Innenmaß A bzw. B = Länge des Profils"]
[]
[null,"Maß C (Tiefe des Gehäuses Innen)"]
[]
[null,"Aussenmaß H",{"$nulls":6},"Innenmaß C bei Verwendung von Platten mit Dicke s = "]
[{"$nulls":8},"s = 1,5 mm",{"$nulls":4},"s = 2,0 mm",{"$nulls":4},"s = 2,5 mm",{"$nulls":4},"s = 3,0 mm"]
[null,null,"H =   30,0 mm",{"$nulls":5},"20,40 mm",{"$nulls":4},"19,40 mm",{"$nulls":3},"nicht möglich",{"$nulls":4},"nicht möglich"]
[null,null,"H =   40,0 mm",{"$nulls":5},"30,40 mm",{"$nulls":4},"29,40 mm",{"$nulls":4},"28,40 mm",{"$nulls":3},"nicht möglich"]
[null,null,"H =   50,0 mm",{"$nulls":5},"40.20 mm",{"$nulls":4},"39,20 mm",{"$nulls":4},"38,20 mm",{"$nulls":4},"37,20 mm"]
[null,null,"H =   60,0 mm",{"$nulls":5},"50,20 mm",{"$nulls":4},"49,20 mm",{"$nulls":4},"48,20 mm",{"$nulls":4},"47,20 mm"]
[null,null,"H =   70,0 mm",{"$nulls":5},"60,20 mm",{"$nulls":4},"59,20 mm",{"$nulls":4},"58,20 mm",{"$nulls":4},"57,20 mm"]
[null,null,"H =   80,0 mm",{"$nulls":5},"70,20 mm",{"$nulls":4},"69,20 mm",{"$nulls":4},"68,20 mm",{"$nulls":4},"67,20 mm"]
[null,null,"H = 100,0 mm",{"$nulls":5},"90,20 mm",{"$nulls":4},"89,20 mm",{"$nulls":4},"88,20 mm",{"$nulls":4},"87,20 mm"]
[]
[null,"Bitte beachten:",{"$nulls":4}," wenn Front- und Rückplatte unterschiedlich dick sind, sind für diese auch"]
[{"$nulls":6}," deren Aussenmaße unterschiedlich (siehe Tab. grauer Kasten)."]

{"sheet":"Plattenmaß","index":2,"n_rows":57,"n_cols":25,"rows_kept":57,"merged":[[1,1,1,7],[23,2,23,6],[27,3,27,9],[30,3,30,5],[30,7,30,9],[30,19,30,21],[30,23,30,25],[32,3,32,5],[32,7,32,9],[32,19,32,21],[32,23,32,25],[34,3,34,5],[34,7,34,9],[34,19,34,21],[34,23,34,25],[36,3,36,5],[36,7,36,9],[36,19,36,21],[36,23,36,25],[38,18,38,21],[47,17,47,21],[47,22,47,26],[48,22,48,26]]}
[]
[null,"zurück zur Startseite"]
[]
["Maßfestlegung über Aussenmaß der ALU-Platte(n)"]
{"$rows_empty":19}
[null,null,"H30",{"$nulls":4},"AUSWAHL Profiltyp"]
[]
[null,"EINGABE Aussenmaß ALU-Platte "]
[]
[{"$nulls":3},"Innenmaß [mm]",{"$nulls":9},"ALU-Platten-",{"$nulls":5},"Abmaße ALU-Platte [mm}"]
[{"$nulls":5},"A ","x","B",{"$nulls":5},"dicke s =",{"$nulls":6},"D",null,"x",null,"E"]
[]
[{"$nulls":3},{"$f":"IF(ProfiltypA=\"H30\",$T$31-(2*7.8),IF(ProfiltypA=\"H40\",$T$31-(2*8.6),IF(ProfiltypA=\"H50\",$T$31-(2*8.5),IF(ProfiltypA=\"H60\",$T$31-(2*8.5),IF(ProfiltypA=\"H70\",$T$31-(2*8.5),IF(ProfiltypA=\"H80\",$T$31-(2*8.5),IF(ProfiltypA=\"H100\",$T$31-(2*8.5),\"FEHLER\")))))))","v":{"v":-15.6,"d":"-15.60"}},null,null,"x",{"$f":"IF(ProfiltypA=\"H30\",$X$31-(2*7.8),IF(ProfiltypA=\"H40\",$X$31-(2*8.6),IF(ProfiltypA=\"H50\",$X$31-(2*8.5),IF(ProfiltypA=\"H60\",$X$31-(2*8.5),IF(ProfiltypA=\"H70\",$X$31-(2*8.5),IF(ProfiltypA=\"H80\",$X$31-(2*8.5),IF(ProfiltypA=\"H100\",$X$31-(2*8.5),\"FEHLER\")))))))","v":{"v":-15.6,"d":"-15.60"}},{"$nulls":5},"1,5 mm",{"$nulls":5},{"v":0,"d":"0.00"},null,null,"x",{"v":0,"d":"0.00"}]
[]
[{"$nulls":3},{"$f":"IF(ProfiltypA=\"H30\",$T$31-(2*4.3),IF(ProfiltypA=\"H40\",$T$31-(2*5.7),IF(ProfiltypA=\"H50\",$T$31-(2*6.3),IF(ProfiltypA=\"H60\",$T$31-(2*6.3),IF(ProfiltypA=\"H70\",$T$31-(2*6.3),IF(ProfiltypA=\"H80\",$T$31-(2*6.3),IF(ProfiltypA=\"H100\",$T$31-(2*6.3),\"FEHLER\")))))))","v":{"v":-8.6,"d":"-8.60"}},null,null,"x",{"$f":"IF(ProfiltypA=\"H30\",$X$31-(2*4.3),IF(ProfiltypA=\"H40\",$X$31-(2*5.7),IF(ProfiltypA=\"H50\",$X$31-(2*6.3),IF(ProfiltypA=\"H60\",$X$31-(2*6.3),IF(ProfiltypA=\"H70\",$X$31-(2*6.3),IF(ProfiltypA=\"H80\",$X$31-(2*6.3),IF(ProfiltypA=\"H100\",$X$31-(2*6.3),\"FEHLER\")))))))","v":{"v":-8.6,"d":"-8.60"}},{"$nulls":5},"2,0 mm"]
[]
[{"$nulls":3},{"$f":"IF(ProfiltypA=\"H30\",\"NV\",IF(ProfiltypA=\"H40\",$T$31-(2*3),IF(ProfiltypA=\"H50\",$T$31-(2*4.3),IF(ProfiltypA=\"H60\",$T$31-(2*4.3),IF(ProfiltypA=\"H70\",$T$31-(2*4.3),IF(ProfiltypA=\"H80\",$T$31-(2*4.3),IF(ProfiltypA=\"H100\",$T$31-(2*4.3),\"FEHLER\")))))))","v":"NV"},null,null,"x",{"$f":"IF(ProfiltypA=\"H30\",\"NV\",IF(ProfiltypA=\"H40\",$X$31-(2*3),IF(ProfiltypA=\"H50\",$X$31-(2*4.3),IF(ProfiltypA=\"H60\",$X$31-(2*4.3),IF(ProfiltypA=\"H70\",$X$31-(2*4.3),IF(ProfiltypA=\"H80\",$X$31-(2*4.3),IF(ProfiltypA=\"H100\",$X$31-(2*4.3),\"FEHLER\")))))))","v":"NV"},{"$nulls":5},"2,5 mm"]
[]
[{"$nulls":3},{"$f":"IF(ProfiltypA=\"H30\",\"NV\",IF(ProfiltypA=\"H40\",\"NV\",IF(ProfiltypA=\"H50\",$T$31-(2*2.3),IF(ProfiltypA=\"H60\",$T$31-(2*2.3),IF(ProfiltypA=\"H70\",$T$31-(2*2.3),IF(ProfiltypA=\"H80\",$T$31-(2*2.3),IF(ProfiltypA=\"H100\",$T$31-(2*2.3),\"FEHLER\")))))))","v":"NV"},null,null,"x",{"$f":"IF(ProfiltypA=\"H30\",\"NV\",IF(ProfiltypA=\"H40\",\"NV\",IF(ProfiltypA=\"H50\",$X$31-(2*2.3),IF(ProfiltypA=\"H60\",$X$31-(2*2.3),IF(ProfiltypA=\"H70\",$X$31-(2*2.3),IF(ProfiltypA=\"H80\",$X$31-(2*2.3),IF(ProfiltypA=\"H100\",$X$31-(2*2.3),\"FEHLER\")))))))","v":"NV"},{"$nulls":5},"3,0 mm"]
[]
[{"$nulls":3},"EINGABE über Innenmaß (Sichtbereich)",{"$nulls":14},"hier klicken"]
[]
[]
[null,"INFO: Innenmaß A bzw. B = Länge des Profils"]
[]
[null,"Maß C (Tiefe des Gehäuses Innen)"]
[]
[null,"Aussenmaß H",{"$nulls":6},"Innenmaß C bei Verwendung von Platten mit Dicke s = "]
[{"$nulls":8},"s = 1,5 mm",{"$nulls":4},"s = 2,0 mm",{"$nulls":4},"s = 2,5 mm",{"$nulls":4},"s = 3,0 mm"]
[null,null,"H =   30,0 mm",{"$nulls":5},"20,40 mm",{"$nulls":4},"19,40 mm",{"$nulls":3},"nicht möglich",{"$nulls":4},"nicht möglich"]
[null,null,"H =   40,0 mm",{"$nulls":5},"30,40 mm",{"$nulls":4},"29,40 mm",{"$nulls":4},"28,40 mm",{"$nulls":3},"nicht möglich"]
[null,null,"H =   50,0 mm",{"$nulls":5},"40.20 mm",{"$nulls":4},"39,20 mm",{"$nulls":4},"38,20 mm",{"$nulls":4},"37,20 mm"]
[null,null,"H =   60,0 mm",{"$nulls":5},"50,20 mm",{"$nulls":4},"49,20 mm",{"$nulls":4},"48,20 mm",{"$nulls":4},"47,20 mm"]
[null,null,"H =   70,0 mm",{"$nulls":5},"60,20 mm",{"$nulls":4},"59,20 mm",{"$nulls":4},"58,20 mm",{"$nulls":4},"57,20 mm"]
[null,null,"H =   80,0 mm",{"$nulls":5},"70,20 mm",{"$nulls":4},"69,20 mm",{"$nulls":4},"68,20 mm",{"$nulls":4},"67,20 mm"]
[null,null,"H = 100,0 mm",{"$nulls":5},"90,20 mm",{"$nulls":4},"89,20 mm",{"$nulls":4},"88,20 mm",{"$nulls":4},"87,20 mm"]
[]
[null,"Bitte beachten:",{"$nulls":4}," wenn Front- und Rückplatte unterschiedlich dick sind, sind für diese auch"]
[{"$nulls":6}," deren Aussenmaße unterschiedlich (siehe Tab. grauer Kasten)."]